{"text_format":"1","workbook":"xlsx","n_sheets":9,"sheets":["User Guide","Fixed Inputs","Variable Inputs","CAPEX Breakdown","Developer Calculations","DisCo Calculations","Dashboard","Sensitivity Analysis","Chart Data"],"not_rendered":{"charts":3,"images":1,"macros":1,"external_links":0,"defined_names":3,"comments":0,"pivot_tables":0},"unopened":[],"bounds":{"document_bytes":16777216,"sheet_cells":100000,"rows_first":2000,"rows_last":500,"rows_between":2000,"halvings":0,"cell_chars":16384,"cell_head_chars":4096},"cells_cut":0,"cells_raw":0,"read":"whole","date_system":"1900"}

{"sheet":"User Guide","index":0,"n_rows":50,"n_cols":6,"rows_kept":50,"cut":false,"hidden":false,"merged":[]}
[]
[]
[]
[]
[]
[]
{"$rows_left_out":45}
{"sheet":"Fixed Inputs","index":1,"n_rows":172,"n_cols":14,"rows_kept":172,"cut":false,"hidden":false,"merged":[]}
[]
[null,"General Assumptions"]
[null,null,"Operations Start Year",null,null,null,null,"The year in which the project becomes operational"]
[null,null,"Construction Year",null,null,{"$f":"IF(ISBLANK(F3),\" \",(F3-1))","v":" "},null,"The year in which the project is constructed. Assumed to be the year before the operations start year"]
[null,null,"Project Operational Period","Years",null,null,null,"The number of years during which the project is operational"]
[null,null,"Valuation Period","Years",null,null,null,"The number of years of operation that should be accounted for in valuation"]
{"$rows_left_out":167}
{"sheet":"Variable Inputs","index":2,"n_rows":64,"n_cols":39,"rows_kept":64,"cut":false,"hidden":false,"merged":[]}
[]
[null,null,null,null,null,null,null,null,0,1,2,3,4,5,6,7,8,9,10,11,12,13,14,15,16,17,18,19,20,21,22,23,24,25,26,27,28,29,30]
[null,null,null,null,null,null,null,null,{"$f":"'Fixed Inputs'!$F$3+(I2-1)","v":-1},{"$f":"'Fixed Inputs'!$F$3+(J2-1)","v":0},{"$f":"'Fixed Inputs'!$F$3+(K2-1)","v":1},{"$f":"'Fixed Inputs'!$F$3+(L2-1)","v":2},{"$f":"'Fixed Inputs'!$F$3+(M2-1)","v":3},{"$f":"'Fixed Inputs'!$F$3+(N2-1)","v":4},{"$f":"'Fixed Inputs'!$F$3+(O2-1)","v":5},{"$f":"'Fixed Inputs'!$F$3+(P2-1)","v":6},{"$f":"'Fixed Inputs'!$F$3+(Q2-1)","v":7},{"$f":"'Fixed Inputs'!$F$3+(R2-1)","v":8},{"$f":"'Fixed Inputs'!$F$3+(S2-1)","v":9},{"$f":"'Fixed Inputs'!$F$3+(T2-1)","v":10},{"$f":"'Fixed Inputs'!$F$3+(U2-1)","v":11},{"$f":"'Fixed Inputs'!$F$3+(V2-1)","v":12},{"$f":"'Fixed Inputs'!$F$3+(W2-1)","v":13},{"$f":"'Fixed Inputs'!$F$3+(X2-1)","v":14},{"$f":"'Fixed Inputs'!$F$3+(Y2-1)","v":15},{"$f":"'Fixed Inputs'!$F$3+(Z2-1)","v":16},{"$f":"'Fixed Inputs'!$F$3+(AA2-1)","v":17},{"$f":"'Fixed Inputs'!$F$3+(AB2-1)","v":18},{"$f":"'Fixed Inputs'!$F$3+(AC2-1)","v":19},{"$f":"'Fixed Inputs'!$F$3+(AD2-1)","v":20},{"$f":"'Fixed Inputs'!$F$3+(AE2-1)","v":21},{"$f":"'Fixed Inputs'!$F$3+(AF2-1)","v":22},{"$f":"'Fixed Inputs'!$F$3+(AG2-1)","v":23},{"$f":"'Fixed Inputs'!$F$3+(AH2-1)","v":24},{"$f":"'Fixed Inputs'!$F$3+(AI2-1)","v":25},{"$f":"'Fixed Inputs'!$F$3+(AJ2-1)","v":26},{"$f":"'Fixed Inputs'!$F$3+(AK2-1)","v":27},{"$f":"'Fixed Inputs'!$F$3+(AL2-1)","v":28},{"$f":"'Fixed Inputs'!$F$3+(AM2-1)","v":29}]
[]
[null,"Growth Indices"]
[null,null,"Annual NGN/USD Depreciation",null,"%"]
{"$rows_left_out":59}
{"sheet":"CAPEX Breakdown","index":3,"n_rows":59,"n_cols":5,"rows_kept":59,"cut":false,"hidden":false,"merged":[[21,2,21,4],[28,2,28,4],[43,2,43,4],[34,2,34,4],[51,2,51,4]]}
[]
[null,null,"TOTAL",null,{"$f":"SUM(E3,E23,E36,E45,E53)","v":0}]
[null,null,"Generation",null,{"$f":"SUM(E4,E9,E12,E16)","v":0}]
[null,null,"Solar PV","USD",{"$f":"SUM(E5:E8)","v":0}]
[null,null,"Modules","USD"]
[null,null,"Racking","USD"]
{"$rows_left_out":54}
{"sheet":"Developer Calculations","index":4,"n_rows":262,"n_cols":39,"rows_kept":262,"cut":false,"hidden":false,"merged":[]}
[]
[null,"Year of Operation",null,null,null,null,null,null,0,1,2,3,4,5,6,7,8,9,10,11,12,13,14,15,16,17,18,19,20,21,22,23,24,25,26,27,28,29,30]
[null,"Calendar Year",null,null,null,null,null,null,{"$f":"'Fixed Inputs'!$F$3+(I2-1)","v":-1},{"$f":"'Fixed Inputs'!$F$3+(J2-1)","v":0},{"$f":"'Fixed Inputs'!$F$3+(K2-1)","v":1},{"$f":"'Fixed Inputs'!$F$3+(L2-1)","v":2},{"$f":"'Fixed Inputs'!$F$3+(M2-1)","v":3},{"$f":"'Fixed Inputs'!$F$3+(N2-1)","v":4},{"$f":"'Fixed Inputs'!$F$3+(O2-1)","v":5},{"$f":"'Fixed Inputs'!$F$3+(P2-1)","v":6},{"$f":"'Fixed Inputs'!$F$3+(Q2-1)","v":7},{"$f":"'Fixed Inputs'!$F$3+(R2-1)","v":8},{"$f":"'Fixed Inputs'!$F$3+(S2-1)","v":9},{"$f":"'Fixed Inputs'!$F$3+(T2-1)","v":10},{"$f":"'Fixed Inputs'!$F$3+(U2-1)","v":11},{"$f":"'Fixed Inputs'!$F$3+(V2-1)","v":12},{"$f":"'Fixed Inputs'!$F$3+(W2-1)","v":13},{"$f":"'Fixed Inputs'!$F$3+(X2-1)","v":14},{"$f":"'Fixed Inputs'!$F$3+(Y2-1)","v":15},{"$f":"'Fixed Inputs'!$F$3+(Z2-1)","v":16},{"$f":"'Fixed Inputs'!$F$3+(AA2-1)","v":17},{"$f":"'Fixed Inputs'!$F$3+(AB2-1)","v":18},{"$f":"'Fixed Inputs'!$F$3+(AC2-1)","v":19},{"$f":"'Fixed Inputs'!$F$3+(AD2-1)","v":20},{"$f":"'Fixed Inputs'!$F$3+(AE2-1)","v":21},{"$f":"'Fixed Inputs'!$F$3+(AF2-1)","v":22},{"$f":"'Fixed Inputs'!$F$3+(AG2-1)","v":23},{"$f":"'Fixed Inputs'!$F$3+(AH2-1)","v":24},{"$f":"'Fixed Inputs'!$F$3+(AI2-1)","v":25},{"$f":"'Fixed Inputs'!$F$3+(AJ2-1)","v":26},{"$f":"'Fixed Inputs'!$F$3+(AK2-1)","v":27},{"$f":"'Fixed Inputs'!$F$3+(AL2-1)","v":28},{"$f":"'Fixed Inputs'!$F$3+(AM2-1)","v":29}]
[]
[null,"Flags"]
[null,null,"Operations Flag",null,null,null,"Flag",null,{"$f":"IF(AND(I2>0,I2<='Fixed Inputs'!$F$5),1,0)","v":0},{"$f":"IF(AND(J2>0,J2<='Fixed Inputs'!$F$5),1,0)","v":0},{"$f":"IF(AND(K2>0,K2<='Fixed Inputs'!$F$5),1,0)","v":0},{"$f":"IF(AND(L2>0,L2<='Fixed Inputs'!$F$5),1,0)","v":0},{"$f":"IF(AND(M2>0,M2<='Fixed Inputs'!$F$5),1,0)","v":0},{"$f":"IF(AND(N2>0,N2<='Fixed Inputs'!$F$5),1,0)","v":0},{"$f":"IF(AND(O2>0,O2<='Fixed Inputs'!$F$5),1,0)","v":0},{"$f":"IF(AND(P2>0,P2<='Fixed Inputs'!$F$5),1,0)","v":0},{"$f":"IF(AND(Q2>0,Q2<='Fixed Inputs'!$F$5),1,0)","v":0},{"$f":"IF(AND(R2>0,R2<='Fixed Inputs'!$F$5),1,0)","v":0},{"$f":"IF(AND(S2>0,S2<='Fixed Inputs'!$F$5),1,0)","v":0},{"$f":"IF(AND(T2>0,T2<='Fixed Inputs'!$F$5),1,0)","v":0},{"$f":"IF(AND(U2>0,U2<='Fixed Inputs'!$F$5),1,0)","v":0},{"$f":"IF(AND(V2>0,V2<='Fixed Inputs'!$F$5),1,0)","v":0},{"$f":"IF(AND(W2>0,W2<='Fixed Inputs'!$F$5),1,0)","v":0},{"$f":"IF(AND(X2>0,X2<='Fixed Inputs'!$F$5),1,0)","v":0},{"$f":"IF(AND(Y2>0,Y2<='Fixed Inputs'!$F$5),1,0)","v":0},{"$f":"IF(AND(Z2>0,Z2<='Fixed Inputs'!$F$5),1,0)","v":0},{"$f":"IF(AND(AA2>0,AA2<='Fixed Inputs'!$F$5),1,0)","v":0},{"$f":"IF(AND(AB2>0,AB2<='Fixed Inputs'!$F$5),1,0)","v":0},{"$f":"IF(AND(AC2>0,AC2<='Fixed Inputs'!$F$5),1,0)","v":0},{"$f":"IF(AND(AD2>0,AD2<='Fixed Inputs'!$F$5),1,0)","v":0},{"$f":"IF(AND(AE2>0,AE2<='Fixed Inputs'!$F$5),1,0)","v":0},{"$f":"IF(AND(AF2>0,AF2<='Fixed Inputs'!$F$5),1,0)","v":0},{"$f":"IF(AND(AG2>0,AG2<='Fixed Inputs'!$F$5),1,0)","v":0},{"$f":"IF(AND(AH2>0,AH2<='Fixed Inputs'!$F$5),1,0)","v":0},{"$f":"IF(AND(AI2>0,AI2<='Fixed Inputs'!$F$5),1,0)","v":0},{"$f":"IF(AND(AJ2>0,AJ2<='Fixed Inputs'!$F$5),1,0)","v":0},{"$f":"IF(AND(AK2>0,AK2<='Fixed Inputs'!$F$5),1,0)","v":0},{"$f":"IF(AND(AL2>0,AL2<='Fixed Inputs'!$F$5),1,0)","v":0},{"$f":"IF(AND(AM2>0,AM2<='Fixed Inputs'!$F$5),1,0)","v":0}]
{"$rows_left_out":257}
{"sheet":"DisCo Calculations","index":5,"n_rows":46,"n_cols":39,"rows_kept":46,"cut":false,"hidden":false,"merged":[]}
[]
[null,"Year of Operation",null,null,null,null,null,null,0,1,2,3,4,5,6,7,8,9,10,11,12,13,14,15,16,17,18,19,20,21,22,23,24,25,26,27,28,29,30]
[null,"Calendar Year",null,null,null,null,null,null,{"$f":"'Fixed Inputs'!$F$3+(I2-1)","v":-1},{"$f":"'Fixed Inputs'!$F$3+(J2-1)","v":0},{"$f":"'Fixed Inputs'!$F$3+(K2-1)","v":1},{"$f":"'Fixed Inputs'!$F$3+(L2-1)","v":2},{"$f":"'Fixed Inputs'!$F$3+(M2-1)","v":3},{"$f":"'Fixed Inputs'!$F$3+(N2-1)","v":4},{"$f":"'Fixed Inputs'!$F$3+(O2-1)","v":5},{"$f":"'Fixed Inputs'!$F$3+(P2-1)","v":6},{"$f":"'Fixed Inputs'!$F$3+(Q2-1)","v":7},{"$f":"'Fixed Inputs'!$F$3+(R2-1)","v":8},{"$f":"'Fixed Inputs'!$F$3+(S2-1)","v":9},{"$f":"'Fixed Inputs'!$F$3+(T2-1)","v":10},{"$f":"'Fixed Inputs'!$F$3+(U2-1)","v":11},{"$f":"'Fixed Inputs'!$F$3+(V2-1)","v":12},{"$f":"'Fixed Inputs'!$F$3+(W2-1)","v":13},{"$f":"'Fixed Inputs'!$F$3+(X2-1)","v":14},{"$f":"'Fixed Inputs'!$F$3+(Y2-1)","v":15},{"$f":"'Fixed Inputs'!$F$3+(Z2-1)","v":16},{"$f":"'Fixed Inputs'!$F$3+(AA2-1)","v":17},{"$f":"'Fixed Inputs'!$F$3+(AB2-1)","v":18},{"$f":"'Fixed Inputs'!$F$3+(AC2-1)","v":19},{"$f":"'Fixed Inputs'!$F$3+(AD2-1)","v":20},{"$f":"'Fixed Inputs'!$F$3+(AE2-1)","v":21},{"$f":"'Fixed Inputs'!$F$3+(AF2-1)","v":22},{"$f":"'Fixed Inputs'!$F$3+(AG2-1)","v":23},{"$f":"'Fixed Inputs'!$F$3+(AH2-1)","v":24},{"$f":"'Fixed Inputs'!$F$3+(AI2-1)","v":25},{"$f":"'Fixed Inputs'!$F$3+(AJ2-1)","v":26},{"$f":"'Fixed Inputs'!$F$3+(AK2-1)","v":27},{"$f":"'Fixed Inputs'!$F$3+(AL2-1)","v":28},{"$f":"'Fixed Inputs'!$F$3+(AM2-1)","v":29}]
[]
[null,"Business as usual "]
[null,null,"Residential customer demand",null,null,null,"kWh",null,{"$f":"_xlfn.XLOOKUP(I3,'Developer Calculations'!$I$3:$AM$3,'Developer Calculations'!$I$17:$AM$17)","v":0},{"$f":"_xlfn.XLOOKUP(J3,'Developer Calculations'!$I$3:$AM$3,'Developer Calculations'!$I$17:$AM$17)","v":0},{"$f":"_xlfn.XLOOKUP(K3,'Developer Calculations'!$I$3:$AM$3,'Developer Calculations'!$I$17:$AM$17)","v":0},{"$f":"_xlfn.XLOOKUP(L3,'Developer Calculations'!$I$3:$AM$3,'Developer Calculations'!$I$17:$AM$17)","v":0},{"$f":"_xlfn.XLOOKUP(M3,'Developer Calculations'!$I$3:$AM$3,'Developer Calculations'!$I$17:$AM$17)","v":0},{"$f":"_xlfn.XLOOKUP(N3,'Developer Calculations'!$I$3:$AM$3,'Developer Calculations'!$I$17:$AM$17)","v":0},{"$f":"_xlfn.XLOOKUP(O3,'Developer Calculations'!$I$3:$AM$3,'Developer Calculations'!$I$17:$AM$17)","v":0},{"$f":"_xlfn.XLOOKUP(P3,'Developer Calculations'!$I$3:$AM$3,'Developer Calculations'!$I$17:$AM$17)","v":0},{"$f":"_xlfn.XLOOKUP(Q3,'Developer Calculations'!$I$3:$AM$3,'Developer Calculations'!$I$17:$AM$17)","v":0},{"$f":"_xlfn.XLOOKUP(R3,'Developer Calculations'!$I$3:$AM$3,'Developer Calculations'!$I$17:$AM$17)","v":0},{"$f":"_xlfn.XLOOKUP(S3,'Developer Calculations'!$I$3:$AM$3,'Developer Calculations'!$I$17:$AM$17)","v":0},{"$f":"_xlfn.XLOOKUP(T3,'Developer Calculations'!$I$3:$AM$3,'Developer Calculations'!$I$17:$AM$17)","v":0},{"$f":"_xlfn.XLOOKUP(U3,'Developer Calculations'!$I$3:$AM$3,'Developer Calculations'!$I$17:$AM$17)","v":0},{"$f":"_xlfn.XLOOKUP(V3,'Developer Calculations'!$I$3:$AM$3,'Developer Calculations'!$I$17:$AM$17)","v":0},{"$f":"_xlfn.XLOOKUP(W3,'Developer Calculations'!$I$3:$AM$3,'Developer Calculations'!$I$17:$AM$17)","v":0},{"$f":"_xlfn.XLOOKUP(X3,'Developer Calculations'!$I$3:$AM$3,'Developer Calculations'!$I$17:$AM$17)","v":0},{"$f":"_xlfn.XLOOKUP(Y3,'Developer Calculations'!$I$3:$AM$3,'Developer Calculations'!$I$17:$AM$17)","v":0},{"$f":"_xlfn.XLOOKUP(Z3,'Developer Calculations'!$I$3:$AM$3,'Developer Calculations'!$I$17:$AM$17)","v":0},{"$f":"_xlfn.XLOOKUP(AA3,'Developer Calculations'!$I$3:$AM$3,'Developer Calculations'!$I$17:$AM$17)","v":0},{"$f":"_xlfn.XLOOKUP(AB3,'Developer Calculations'!$I$3:$AM$3,'Developer Calculations'!$I$17:$AM$17)","v":0},{"$f":"_xlfn.XLOOKUP(AC3,'Developer Calculations'!$I$3:$AM$3,'Developer Calculations'!$I$17:$AM$17)","v":0},{"$f":"_xlfn.XLOOKUP(AD3,'Developer Calculations'!$I$3:$AM$3,'Developer Calculations'!$I$17:$AM$17)","v":0},{"$f":"_xlfn.XLOOKUP(AE3,'Developer Calculations'!$I$3:$AM$3,'Developer Calculations'!$I$17:$AM$17)","v":0},{"$f":"_xlfn.XLOOKUP(AF3,'Developer Calculations'!$I$3:$AM$3,'Developer Calculations'!$I$17:$AM$17)","v":0},{"$f":"_xlfn.XLOOKUP(AG3,'Developer Calculations'!$I$3:$AM$3,'Developer Calculations'!$I$17:$AM$17)","v":0},{"$f":"_xlfn.XLOOKUP(AH3,'Developer Calculations'!$I$3:$AM$3,'Developer Calculations'!$I$17:$AM$17)","v":0},{"$f":"_xlfn.XLOOKUP(AI3,'Developer Calculations'!$I$3:$AM$3,'Developer Calculations'!$I$17:$AM$17)","v":0},{"$f":"_xlfn.XLOOKUP(AJ3,'Developer Calculations'!$I$3:$AM$3,'Developer Calculations'!$I$17:$AM$17)","v":0},{"$f":"_xlfn.XLOOKUP(AK3,'Developer Calculations'!$I$3:$AM$3,'Developer Calculations'!$I$17:$AM$17)","v":0},{"$f":"_xlfn.XLOOKUP(AL3,'Developer Calculations'!$I$3:$AM$3,'Developer Calculations'!$I$17:$AM$17)","v":0},{"$f":"_xlfn.XLOOKUP(AM3,'Developer Calculations'!$I$3:$AM$3,'Developer Calculations'!$I$17:$AM$17)","v":0}]
{"$rows_left_out":41}
{"sheet":"Dashboard","index":6,"n_rows":35,"n_cols":24,"rows_kept":35,"cut":false,"hidden":false,"merged":[]}
[]
[null,null,"Developer Summary and Charts"]
[null,null,"Project Economics",null,null,null,null,null,"Project CAPEX Summary",null,null,null,null,"Unit CAPEX Costs",null,null,null,null,null,"Project Returns"]
[null,null,"Starting Residential Customer Tariff",null,null,"NGN/kWh",{"$f":"Res_Tariff","v":0},null,"Generation Assets",null,"USD",{"$f":"'CAPEX Breakdown'!E3","v":0},null,"Solar PV",null,null,"USD/kW",{"$f":"'CAPEX Breakdown'!E4/'Fixed Inputs'!F80","v":{"$error":"#DIV/0!"}},null,"Project IRR",null,null,"%",{"$f":"Project_IRR","v":0}]
[null,null,"Starting Commercial Customer Tariff",null,null,"NGN/kWh",{"$f":"'Fixed Inputs'!F28","v":0},null,"Distribution Assets",null,"USD",{"$f":"'CAPEX Breakdown'!E23","v":0},null,"Battery Storage System",null,null,"USD/kWh",{"$f":"'CAPEX Breakdown'!E9/'Fixed Inputs'!F81","v":{"$error":"#DIV/0!"}},null,"Equity IRR",null,null,"%",{"$f":"'Developer Calculations'!D125","v":0}]
[null,null,"Starting Residential Customer Tariff",null,null,"USD/kWh",{"$f":"'Fixed Inputs'!F26","v":0},null,"Metering",null,"USD",{"$f":"'CAPEX Breakdown'!E36","v":0},null,"Diesel/Gas Genset",null,null,"USD/kVA",{"$f":"'CAPEX Breakdown'!E12/'Fixed Inputs'!F82","v":{"$error":"#DIV/0!"}},null,"Undiscounted Project Payback Period",null,null,"Years",{"$f":"'Developer Calculations'!D112","v":{"$error":"#DIV/0!"}}]
{"$rows_left_out":30}
{"sheet":"Sensitivity Analysis","index":7,"n_rows":66,"n_cols":17,"rows_kept":66,"cut":false,"hidden":false,"merged":[]}
[]
[null,"Note: Currently, automatic recalculation is turned off for these tables to speed up calculations in this document. Follow the instructions below to update the sensitivity analysis. "]
[null,"In the Formulas tab, click the arrow on Calculation Options (in the Calculation group), then click Automatic "]
[]
[null,null,null,"Impact of Customer Tariff and Grant % of CAPEX on IRR"]
[null,null,null,"Grant % of CAPEX",null,null,null,null,null,null,null,null,null,null,null,null,"Note: This table assumes there is only one grant (Grant 1). "]
{"$rows_left_out":61}
{"sheet":"Chart Data","index":8,"n_rows":20,"n_cols":39,"rows_kept":20,"cut":false,"hidden":false,"merged":[]}
[]
[null,"Year of Operation",null,null,null,null,null,null,0,1,2,3,4,5,6,7,8,9,10,11,12,13,14,15,16,17,18,19,20,21,22,23,24,25,26,27,28,29,30]
[null,"Calendar Year",null,null,null,null,null,null,{"$f":"'Fixed Inputs'!$F$3+(I2-1)","v":-1},{"$f":"'Fixed Inputs'!$F$3+(J2-1)","v":0},{"$f":"'Fixed Inputs'!$F$3+(K2-1)","v":1},{"$f":"'Fixed Inputs'!$F$3+(L2-1)","v":2},{"$f":"'Fixed Inputs'!$F$3+(M2-1)","v":3},{"$f":"'Fixed Inputs'!$F$3+(N2-1)","v":4},{"$f":"'Fixed Inputs'!$F$3+(O2-1)","v":5},{"$f":"'Fixed Inputs'!$F$3+(P2-1)","v":6},{"$f":"'Fixed Inputs'!$F$3+(Q2-1)","v":7},{"$f":"'Fixed Inputs'!$F$3+(R2-1)","v":8},{"$f":"'Fixed Inputs'!$F$3+(S2-1)","v":9},{"$f":"'Fixed Inputs'!$F$3+(T2-1)","v":10},{"$f":"'Fixed Inputs'!$F$3+(U2-1)","v":11},{"$f":"'Fixed Inputs'!$F$3+(V2-1)","v":12},{"$f":"'Fixed Inputs'!$F$3+(W2-1)","v":13},{"$f":"'Fixed Inputs'!$F$3+(X2-1)","v":14},{"$f":"'Fixed Inputs'!$F$3+(Y2-1)","v":15},{"$f":"'Fixed Inputs'!$F$3+(Z2-1)","v":16},{"$f":"'Fixed Inputs'!$F$3+(AA2-1)","v":17},{"$f":"'Fixed Inputs'!$F$3+(AB2-1)","v":18},{"$f":"'Fixed Inputs'!$F$3+(AC2-1)","v":19},{"$f":"'Fixed Inputs'!$F$3+(AD2-1)","v":20},{"$f":"'Fixed Inputs'!$F$3+(AE2-1)","v":21},{"$f":"'Fixed Inputs'!$F$3+(AF2-1)","v":22},{"$f":"'Fixed Inputs'!$F$3+(AG2-1)","v":23},{"$f":"'Fixed Inputs'!$F$3+(AH2-1)","v":24},{"$f":"'Fixed Inputs'!$F$3+(AI2-1)","v":25},{"$f":"'Fixed Inputs'!$F$3+(AJ2-1)","v":26},{"$f":"'Fixed Inputs'!$F$3+(AK2-1)","v":27},{"$f":"'Fixed Inputs'!$F$3+(AL2-1)","v":28},{"$f":"'Fixed Inputs'!$F$3+(AM2-1)","v":29}]
[]
[null,"Developer Charts"]
[null,null,"Residential Customer Tariff",null,null,null,"N/kWh",null,{"$f":"'Developer Calculations'!I27","v":0},{"$f":"'Developer Calculations'!J27","v":0},{"$f":"'Developer Calculations'!K27","v":0},{"$f":"'Developer Calculations'!L27","v":0},{"$f":"'Developer Calculations'!M27","v":0},{"$f":"'Developer Calculations'!N27","v":0},{"$f":"'Developer Calculations'!O27","v":0},{"$f":"'Developer Calculations'!P27","v":0},{"$f":"'Developer Calculations'!Q27","v":0},{"$f":"'Developer Calculations'!R27","v":0},{"$f":"'Developer Calculations'!S27","v":0},{"$f":"'Developer Calculations'!T27","v":0},{"$f":"'Developer Calculations'!U27","v":0},{"$f":"'Developer Calculations'!V27","v":0},{"$f":"'Developer Calculations'!W27","v":0},{"$f":"'Developer Calculations'!X27","v":0},{"$f":"'Developer Calculations'!Y27","v":0},{"$f":"'Developer Calculations'!Z27","v":0},{"$f":"'Developer Calculations'!AA27","v":0},{"$f":"'Developer Calculations'!AB27","v":0},{"$f":"'Developer Calculations'!AC27","v":0},{"$f":"'Developer Calculations'!AD27","v":0},{"$f":"'Developer Calculations'!AE27","v":0},{"$f":"'Developer Calculations'!AF27","v":0},{"$f":"'Developer Calculations'!AG27","v":0},{"$f":"'Developer Calculations'!AH27","v":0},{"$f":"'Developer Calculations'!AI27","v":0},{"$f":"'Developer Calculations'!AJ27","v":0},{"$f":"'Developer Calculations'!AK27","v":0},{"$f":"'Developer Calculations'!AL27","v":0},{"$f":"'Developer Calculations'!AM27","v":0}]
{"$rows_left_out":14}